{"text_format":"1","workbook":"xlsx","n_sheets":5,"sheets":["Read Me","Data Inputs","SCR Design Parameters","Cost Estimate","ESRI_MAPINFO_SHEET"],"not_rendered":{"charts":0,"images":0,"macros":1,"external_links":1,"defined_names":3,"comments":1,"pivot_tables":0},"unopened":[],"bounds":{"document_bytes":16777216,"sheet_cells":100000,"rows_first":2000,"rows_last":500,"rows_between":2000,"halvings":0,"cell_chars":16384,"cell_head_chars":4096},"cells_cut":0,"cells_raw":0,"read":"whole","date_system":"1900"}

{"sheet":"Read Me","index":0,"n_rows":27,"n_cols":3,"rows_kept":27,"cut":false,"hidden":false,"merged":[[25,1,25,13],[26,1,26,13],[0,0,0,14],[1,0,1,14],[8,1,8,13],[10,1,10,13],[22,1,22,13],[2,0,2,14],[3,0,3,14],[4,0,4,14],[5,0,5,14],[6,0,6,14],[21,1,21,13],[19,1,19,13],[12,1,12,13],[14,2,14,12],[15,2,15,12],[16,2,16,12],[17,2,17,12],[23,1,23,13],[24,1,24,13]]}
["Air Pollution Control Cost Estimation Spreadsheet"]
["For Selective Catalytic Reduction (SCR)"]
["U.S. Environmental Protection Agency "]
["Air Economics Group"]
["Health and Environmental Impacts Division"]
["Office of Air Quality Planning and Standards"]
["(May 2016)"]
[]
[null,"This spreadsheet allows users to estimate the capital and annualized costs for installing and operating a Selective Catalytic Reduction (SCR) control device. SCR is a post-combustion control technology for reducing NOx emissions that employs a metal-based catalyst and an ammonia-based reducing reagent (urea or ammonia). The reagent reacts selectively with the flue gas NOx within a specific temperature range to produce N2 and water vapor. "]
[]
[null,"The calculation methodologies used in this spreadsheet are those presented in the U.S. EPA's Air Pollution Control Cost Manual.  This spreadsheet is intended to be used in combination with the SCR chapter and cost estimation methodology in the Control Cost Manual. For a detailed description of the SCR control technology and the cost methodologies, see Section 4, Chapter 2 of the Air Pollution Control Cost Manual (as updated in 2016).  A copy of the Control Cost Manual is available on the U.S. EPA's \"Technology Transfer Network\" website at: http://www3.epa.gov/ttn/catc/products.html#cccinfo."]
[]
[null,"The spreadsheet can be used to estimate capital and annualized costs for applying SCR, and particularly to the following types of combustion units:"]
[]
[null,"(1)   ","Coal-fired utility boilers with full load capacities greater than or equal to 25 MW."]
[null,"(2)   ","Fuel oil- and natural gas-fired utility boilers with full load capacities greater than or equal to 25 MW."]
[null,"(3)   ","Coal-fired industrial boilers with maximum heat input capacities greater than or equal to 250 MMBtu/hour."]
[null,"(4)   ","Fuel oil- and natural gas-fired industrial boilers with maximum heat input capacities greater than or equal to 250 MMBtu/hour."]
[]
[null,"The methodology used in this spreadsheet is based on the U.S. EPA Clean Air Markets Division (CAMD)'s Integrated Planning Model (IPM) (version 5.13). The size and costs of the SCR are based primarily on five parameters: the boiler size or heat input, the type of fuel burned, the required level of NOx reduction, reagent consumption rate, and catalyst costs. The equations for utility boilers are identical to those used in the IPM. However, the equations for industrial boilers were developed based on the IPM equations for utility boilers. This approach provides study-level estimates (±30%) of SCR capital and annual costs. Default data in the spreadsheet is taken from the SCR Control Cost Manual and other sources such as the U.S. Energy Information Administration (EIA).  The actual costs may vary from those calculated here due to site-specific conditions. Selection of the most cost-effective control option should be based on a detailed engineering study and cost quotations from system suppliers.  For additional information regarding the IPM, see the EPA Clean Air Markets webpage at http://www.epa.gov/airmarkets/power-sector-modeling.  The Agency wishes to note that all spreadsheet data inputs other than default data are merely available to show an example calculation.  "]
[]
[null,"Instructions "]
[null,"Step 1: Please select on the Data Inputs tab and click on the Reset Form button. This will clear many of the input cells and reset others to default values.   "]
[null,"Step 2:  Select the type of combustion unit (utility or industrial) using the pull down menu. Indicate whether the SCR is for new construction or retofit of an existing boiler. If the SCR will be installed on an existing boiler, enter a retrofit factor between 0.8 and 1.5. Use 1 for retrofits with an average level of difficulty. For the more difficult retrofits, you may use a retrofit factor greater than 1; however, you must document why the value used is appropriate."]
[null,"Step 3:  Select the type of fuel burned (coal, fuel oil, and natural gas) using the pull down menu. If you select fuel oil or natural gas, the HHV and NPHR fields will be prepopulated with default values. If you select coal, then you must complete the coal input box by first selecting the type of coal burned from the drop down menu. The weight percent sulfur content, HHV, and NPHR will be pre-populated with default factors based on the type of coal selected. However, we encourage you to enter your own values for these parameters, if they are known, since the actual fuel parameters may vary from the default values provided. Method 1 is pre-selected as the default method for calculating the catalyst replacement cost. For coal-fired units, you choose either method 1 or method 2 for calculating the catalyst replacement cost by selecting appropriate radio button. "]
[null,"Step 4: Complete all of the cells highlighted in yellow. If you do not know the catalyst volume (Volcatalyst) or flue gas flow rate (Qflue gas), please enter \"UNK\" and these values will be calculated for you. As noted in step 1 above, some of the highlighted cells are pre-populated with default values based on 2014 data. Users should document the source of all values entered in accordance with what is recommended in the Control Cost Manual, and the use of actual values other than the default values in this spreadsheet, if appropriately documented, is acceptable. You may also adjust the maintenance and administrative charges cost factors (cells highlighted in blue) from their default values of 0.005 and 0.03, respectively. The default values for these two factors were developed for the CAMD Integrated Planning Model (IPM). If you elect to adjust these factors, you must document why the alternative values used are appropriate.   "]
[null,"Step 5: Once all of the data fields are complete, select the SCR Design Parameters tab to see the calculated design parameters and the Cost Estimate tab to view the calculated cost data for the installation and operation of the SCR. "]

{"sheet":"Data Inputs","index":1,"n_rows":74,"n_cols":22,"rows_kept":74,"cut":false,"hidden":false,"merged":[[57,8,57,13],[73,3,73,8],[68,3,68,8],[69,3,69,8],[70,3,70,8],[70,9,70,13],[71,9,71,13],[72,9,72,13],[73,9,73,13],[71,3,71,8],[72,3,72,8],[68,9,68,13],[69,9,69,13],[59,1,59,7],[58,8,58,13],[0,0,0,13],[2,0,2,13],[16,9,16,11],[18,6,18,7],[19,6,19,7],[11,5,11,7],[11,9,11,10],[6,0,6,2],[5,0,5,2],[17,6,17,7],[12,1,12,3],[14,5,14,13],[15,6,15,12],[12,6,12,11],[6,4,6,8],[34,7,34,9],[35,7,35,9],[34,11,34,13],[35,11,35,13],[20,6,20,7],[22,6,22,9],[24,11,24,13],[24,5,24,10],[25,5,25,10],[37,4,37,8],[54,8,54,13],[55,8,55,13],[56,8,56,13],[36,11,36,13],[38,11,38,13],[39,11,39,13],[39,7,39,9],[40,4,42,8],[56,3,56,7]]}
["Data Inputs"]
[]
["Enter the following data for your combustion unit:"]
["Is the combustion unit a utility or industrial boiler?",null,null,null,null,"What type of fuel does the unit burn?"]
["Is the SCR for a new boiler or retrofit of an existing boiler?"]
[]
[{"$f":"IF(S8=3, \"Please enter a retrofit factor between 0.8 and 1.5 based on the level of difficulty.  Enter 1 for projects of average retrofit difficulty.\", \" \")","v":"Please enter a retrofit factor between 0.8 and 1.5 based on the level of difficulty.  Enter 1 for projects of average retrofit difficulty."},null,null,1.5,{"$f":"IF(D7>1, \"* NOTE: You must document why a retrofit factor of \"&D7&\" is appropriate for the proposed project.\", \" \")","v":"* NOTE: You must document why a retrofit factor of 1.5 is appropriate for the proposed project."},null,null,null,null,null,null,null,null,null,null,null," "]
["Complete all of the highlighted data fields:",null,null,null,null,null,null,null,null,null,null,null,null,null,null,3,"Utility",null,3,"New Construction"]
[null,null,null,null,null,"Provide the following information for coal-fired boilers:",null,null,null,null,null,null,null,null,null,null,"Industrial",null,null,"Retrofit"]
[null,"What is the rating at full load capacity (MMBtu/hr)?",230,"MMBtu/hr",null,"Type of coal burned:",null,null,null,null,null,null,null,null,null,null,null,null,null,"SO2 Emission Rate (lbs SO2/MMBtu) = ",null,{"$f":"IF(I12=\" \", \"NA\",((I12/100)*(64/32)*1000000)/C12)","v":0.52910052910052907}]
[null,null," ",null,null,null,null,null,null,null,null,null,null,null,null,null,null,"Bituminous",null,"SO2 Emission Rate",null,{"$f":"IF(V10=\"NA\",1, (IF(V10<3,2,(IF(V10>3,3)))))","v":2}]
[null,"What is the higher heating value (HHV) of the fuel?",7560,"Btu/lb",null,"Enter the sulfur content (%S) =",null,null,0.2,"percent by weight",null,null,null,null,null,1,null,"Sub-Bituminous",3]
[null,{"$f":"IF(OR(C12=C73, C12=1030,C12=11814,C12=6534,C12=8730,C12=139713),\"*HHV value of \"&C12&\" \"&D12&\" is a default value. See below for data source. Enter actual HHV for fuel burned, if known. \",\" \")","v":" "},null,null,null,null,{"$f":"IF(P17=2, (IF(OR(I12=0.91,I12=0.31,I12=2.35,I12=C72),\"*The sulfur content of \"&I12&\"% is a default value. See below for data source. Enter actual value, if known.\", \" \")), \" \")","v":" "},null,null,null,null,null,null,null,null,null,null,"Lignite"]
[null,"What is the estimated actual annual fuel consumption?",{"$f":"660000000/6","v":110000000},"lbs/year",null,null,null,null,null,null,null,null,null,null,null,null,null,"Coal blend"]
[null,null," ",null,null,"For units burning coal blends:",null,null,null,null,null,null,null,null,null,null,null,"Not Applicable"]
[null,null,null,null,null,null,"Note: The table below is pre-populated with default values for HHV and  %S. Please enter the actual  values for these parameters in the table below. If the actual value for any parameter is not known, you may use the default values provided.   ",null,null,null,null,null,null,null,null,null,"Coal"]
[null,"Enter the net plant heat input rate (NPHR)",10,"MMBtu/MW",null,null,null,null,null,null,null,null,null,null,null,2,"Fuel Oil"]
[null,null," ",null,null,null,null,null,"Fraction in Coal Blend","%S","HHV (Btu/lb)",null,null,null,null,null,"Natural Gas"]
[null,"If the NPHR is not known, use the default NPHR value:  ","Fuel Type","Default NPHR",null,null,"Bituminous",null,0,2.35,11814]
[null,null,"Coal","10 MMBtu/MW",null,null,"Sub-Bituminous",null,1,0.2,{"$f":"C12","v":7560}]
[null,null,"Fuel Oil","11 MMBtu/MW",null,null,"Lignite",null,0,0.91,6534]
[null,null,"Natural Gas","8.2 MMBtu/MW"]
[null,null,null,null,null,null,"Please click the calculate button to calculate weighted values based on the data in the table above.  "]
[null,"Plant Elevation  ",450,"Feet above sea level"]
[null,null,null,null,null,"For coal-fired boilers, you may use either Method 1 or Method 2 to calculate the catalyst replacement cost.  The equations for both methods are shown on rows 85 and 86 on the Cost Estimate tab. Please select your preferred method: "]
[null,null,null,null,null,{"$f":"IF(AND(P17=2,P26=3), \"* You must select either method 1 or method 2 for a coal-fired boiler!\", \" \")","v":" "},null,null,null,null,null,null,null,null,null,1]
[]
["Enter the following design parameters for the proposed SCR:"]
[]
[]
{"$rows_left_out":45}
{"sheet":"SCR Design Parameters","index":2,"n_rows":65,"n_cols":12,"rows_kept":65,"cut":false,"hidden":false,"merged":[[2,0,2,5],[0,0,0,5],[50,3,50,5],[51,3,51,5],[52,3,52,5],[53,3,53,5],[18,4,18,5],[19,4,19,5],[24,0,24,3],[20,4,23,5],[46,2,46,3],[49,3,49,5]]}
["SCR Design Parameters"]
[]
["The following design parameters for the SCR were calculated based on the values entered on the Data Inputs tab. These values were used to prepare the costs shown on the Cost Estimate tab."]
[]
["Parameter","Equation","Calculated Value","Units"]
["Maximum Annual Heat Input Rate (QB) = ",{"$f":"IF('Data Inputs'!P8=2,\"Bmw x NPHR =\", \"HHV x Max. Fuel Rate =\")","v":"HHV x Max. Fuel Rate ="},{"$f":"IF('Data Inputs'!P8=2,('Data Inputs'!C10*'Data Inputs'!C17),'Data Inputs'!C10)","v":230},"MMBtu/hour"]
[{"$f":"IF('Data Inputs'!P8=2,\"Maximum Annual MW Output (Bmw) =\",(IF('Data Inputs'!P8=3,\"Maximum Annual fuel consumption (mfuel) =\",\" \")))","v":"Maximum Annual fuel consumption (mfuel) ="},{"$f":"IF('Data Inputs'!P8=2, \"Bmw x 8760 = \", (IF('Data Inputs'!P8=3, \"(QB x 1.0E6 x 8760)/HHV =\", \" \")))","v":"(QB x 1.0E6 x 8760)/HHV ="},{"$f":"IF('Data Inputs'!P8=3,((('SCR Design Parameters'!C6/'Data Inputs'!C12)*1000000)*8760),(IF('Data Inputs'!P8=2,('Data Inputs'!C10*8760),\" \")))","v":266507936.50793651},{"$f":"'Data Inputs'!D14","v":"lbs/year"}]
[{"$f":"IF('Data Inputs'!P8=2,\"Estimated Actual Annual MW Output (Boutput) =\",(IF('Data Inputs'!P8=3,\"Actual Annual fuel consumption (Mactual) =\",\" \")))","v":"Actual Annual fuel consumption (Mactual) ="},null,{"$f":"660000000/6","v":110000000},{"$f":"'Data Inputs'!D14","v":"lbs/year"}]
["Heat Rate Factor (HRF) =","NPHR/10 =",{"$f":"'Data Inputs'!C17/10","v":1}]
["Total System Capacity Factor (CFtotal) =",{"$f":"IF('Data Inputs'!P8=2, \"(Boutput/Bmw)*(tscr/tplant) =\", (IF('Data Inputs'!P8=3, \"(Mactual/Mfuel) x (tscr/tplant)  =\", \" \")))","v":"(Mactual/Mfuel) x (tscr/tplant)  ="},{"$f":"(C8/C7)*('Data Inputs'!C31/'Data Inputs'!C32)","v":0.41274568195354377},"fraction"]
["Total operating time for the SCR (top) =","CFtotal x 8760 =",{"$f":"C10*8760","v":3615.6521739130435},"hours"]
["NOx Removal Efficiency (EF) =","(NOxin- NOxout)/NOxin =",{"$f":"'Data Inputs'!C34","v":90},"percent"]
["NOx removed per hour =","NOxin x EF x QB  =",{"$f":"(C12/100)*'Data Inputs'!C33*'SCR Design Parameters'!C6","v":120.06},"lb/hour"]
["Total NOx removed per year =","(NOxin x EF x QB x top)/2000 =",{"$f":"C13*C11/2000","v":217.04760000000002},"tons/year"]
["NOx removal factor (NRF) = ","EF/80",{"$f":"C12/80","v":1.125}]
["Volumetric flue gas flow rate (qflue gas) =","Qfuel x QB x (460 + T)/(460 + 700)nscr",{"$f":"IF(OR('Data Inputs'!K36=\"UNK\", 'Data Inputs'!K36=\" \"), ('Data Inputs'!K40*'SCR Design Parameters'!C6*(460+'Data Inputs'!K39))/((460+700)*'Data Inputs'!K31), 'Data Inputs'!K36)","v":240000},"acfm"]
["Space velocity (Vspace) =","qflue gas/Volcatalyst ",{"$f":"C16/C34","v":71.208928932787529},"/hour"]
["Residence Time ","1/Vspace",{"$f":"1/C17","v":1.4043182715806285E-2},"hour"]
["Coal Factor (CoalF) =","1 for oil and natural gas; 1 for bituminous; 1.05 for sub-bituminous; 1.07 for lignite (weighted average is used for coal blends)",{"$f":"IF('Data Inputs'!P17=2, (IF('Data Inputs'!S12=2,1,(IF('Data Inputs'!S12=3,1.05,(IF('Data Inputs'!S12=4,1.07,J19)))))), 1)","v":1.05},null,null,null,null,null,null,{"$f":"((1*'Data Inputs'!I19)+(1.05*'Data Inputs'!I20)+(1.07*'Data Inputs'!I21))/SUM('Data Inputs'!I19:I21)","v":1.05},"CoalF for blended fuel"]
["SO2 Emission rate =  ","(%S/100)x(64/32)*1E6)/HHV =",{"$f":"IF('Data Inputs'!V11=2,\"< 3\",(IF('Data Inputs'!V11=3,\"> 3\",\" \")))","v":"< 3"},{"$f":"IF('Data Inputs'!P17=2, \"lbs/MMBtu\", \" \")","v":"lbs/MMBtu"},{"$f":"IF('Data Inputs'!P17<>2,\"Not applicable; factor applies only to coal-fired boilers\", \" \")","v":" "}]
["Elevation Factor (ELEVF)  = ","14.7 psia/P =",null,null,{"$f":"IF('[1]Data Inputs'!C24<500, \"Not applicable; elevation factor does not apply to plants located at elevations below 500 feet.\", \" \")","v":"Not applicable; elevation factor does not apply to plants located at elevations below 500 feet."}]
[{"$f":"IF('Data Inputs'!I32=0,\"Atmospheric pressure at sea level (P) =\",\"Atmospheric pressure at \"&'Data Inputs'!I32&\" feet above sea level (P) =\")","v":"Atmospheric pressure at sea level (P) ="},"2116x[(59-(0.00356xh)+459.7)/518.6]5.256 x (1/144)* =",{"$f":"(2116)*(((59-(0.00356*'Data Inputs'!C24)+459.7)/518.6)^5.256)*(1/144)","v":14.472129091012603},"psia"]
[null,{"$f":"IF('Data Inputs'!S8=2,\"New Construction\",(IF('Data Inputs'!S8=3,\"SNCR Retrofit\",\" \")))","v":"SNCR Retrofit"},{"$f":"IF('Data Inputs'!S8=2,1,(IF('Data Inputs'!S8=3,1.19,\" \")))","v":1.19}]
["Retrofit Factor (RF)",{"$f":"IF('Data Inputs'!S8=2,\"New Construction\",(IF('Data Inputs'!S8=3,\"Retrofit to existing boiler\",\" \")))","v":"Retrofit to existing boiler"},{"$f":"'Data Inputs'!D7","v":1.5}]
["* Equation is from the National Aeronautics and Space Administration (NASA), Earth Atmosphere Model. Available at https://spaceflightsystems.grc.nasa.gov/education/rocket/atmos.html. "]
[]
[]
[]
[]
["Catalyst Data:"]
{"$rows_left_out":36}
{"sheet":"Cost Estimate","index":3,"n_rows":104,"n_cols":10,"rows_kept":104,"cut":false,"hidden":false,"merged":[[82,0,82,1],[68,0,68,4],[6,0,6,4],[101,3,101,4],[55,0,55,3],[66,0,66,4],[90,0,90,4],[97,0,97,4],[99,0,99,4],[57,0,57,4],[58,0,58,4],[59,0,59,4],[75,0,75,4],[76,0,76,4],[89,0,89,4],[69,0,69,4],[0,0,0,4],[2,0,2,4],[21,0,21,4],[4,0,4,4],[7,0,7,4],[8,0,8,4],[13,0,13,4],[15,0,15,4],[16,0,16,4],[14,0,14,4],[20,0,20,4],[12,0,12,4],[5,0,5,4],[42,0,42,4],[61,0,61,4],[51,0,51,4],[33,0,33,4],[49,0,49,4],[48,0,48,4],[50,0,50,4],[34,0,34,4],[43,0,43,4],[44,0,44,4],[52,0,52,4],[35,0,35,4],[36,0,36,4],[29,0,29,3],[10,0,10,4],[32,0,32,4],[40,0,40,4],[41,0,41,4],[22,0,22,4]]}
["Cost Estimate"]
[]
["Total Capital Investment (TCI)",null,null,null,null,null,{"$f":"IF('Data Inputs'!C24<500, 1,'SCR Design Parameters'!C21)","v":1},"ELEVF"]
[]
["TCI for Oil and Natural Gas Boilers"]
["For Oil and Natural Gas-Fired Utility Boilers between 25MW and 500 MW:",null,null,null,null,null,"New ","Retrofit"]
["TCI = 80,000 x (200/BMW )0.35 x BMW x ELEVF x RF",null,null,null,null,null,{"$f":"IF(AND('Data Inputs'!S8=2,'Data Inputs'!P8=2,'Data Inputs'!P17>2,'Data Inputs'!C10<500.1),(80000*((200/'Data Inputs'!C10)^0.35)*'Data Inputs'!C10*G3*0.8), 0)","v":0},{"$f":"IF(AND('Data Inputs'!S8=3,'Data Inputs'!P8=2,'Data Inputs'!P17>2,'Data Inputs'!C10<500.1),(80000*((200/'Data Inputs'!C10)^0.35)*'Data Inputs'!C10*G3*'Data Inputs'!D7), 0)","v":0}]
["For Oil and Natural Gas-Fired Utility Boilers >500 MW:"]
["TCI = 60,670 x BMW x ELEVF x RF",null,null,null,null,null,{"$f":"IF(AND('Data Inputs'!S8=2,'Data Inputs'!P8=2, 'Data Inputs'!P17>2, 'Data Inputs'!C10>500), (60670*'Data Inputs'!C10*G3*0.8), 0)","v":0},{"$f":"IF(AND('Data Inputs'!S8=3,'Data Inputs'!P8=2, 'Data Inputs'!P17>2, 'Data Inputs'!C10>500), (60670*'Data Inputs'!C10*G3*'Data Inputs'!D7), 0)","v":0}]
["For Oil-Fired Industrial Boilers between 275 and 5,500 MMBTU/hour :"]
["TCI = 7,270 x (2,200/QB )0.35 x QB x ELEVF x RF",null,null,null,null,null,{"$f":"IF(AND('Data Inputs'!S8=2,'Data Inputs'!P8=3, 'Data Inputs'!P17=3, 'Data Inputs'!C10<5500.1),(7270*((2200/'Data Inputs'!C10)^0.35)*'Data Inputs'!C10*G3*0.8), 0)","v":0},{"$f":"IF(AND('Data Inputs'!S8=3,'Data Inputs'!P8=3, 'Data Inputs'!P17=3, 'Data Inputs'!C10<5500.1),(7270*((2200/'Data Inputs'!C10)^0.35)*'Data Inputs'!C10*G3*'Data Inputs'!D7), 0)","v":0}]
["For Natural Gas-Fired Industrial Boilers between 205 and 4,100 MMBTU/hour :",null,null,null,null,null,null,null,null," "]
["TCI = 9,760 x (1,640/QB )0.35 x QB x ELEVF x RF",null,null,null,null,null,{"$f":"IF(AND('Data Inputs'!S8=2,'Data Inputs'!P8=3, 'Data Inputs'!P17=4, 'Data Inputs'!C10<4100.1),(9760*((1640/'Data Inputs'!C10)^0.35)*'Data Inputs'!C10*G3*0.8), 0)","v":0},{"$f":"IF(AND('Data Inputs'!S8=3,'Data Inputs'!P8=3, 'Data Inputs'!P17=4, 'Data Inputs'!C10<4100.1),(9760*((1640/'Data Inputs'!C10)^0.35)*'Data Inputs'!C10*G3*'Data Inputs'!D7), 0)","v":0}]
["For Oil-Fired Industrial Boilers >5,500 MMBtu/hour: "]
["TCI = 5,275 x QB x ELEVF x RF",null,null,null,null,null,{"$f":"IF(AND('Data Inputs'!S8=2,'Data Inputs'!P8=3, 'Data Inputs'!P17=3, 'Data Inputs'!C10>5500),(5275*'Data Inputs'!C10*G3*0.8), 0)","v":0},{"$f":"IF(AND('Data Inputs'!S8=3,'Data Inputs'!P8=3, 'Data Inputs'!P17=3, 'Data Inputs'!C10>5500),(5275*'Data Inputs'!C10*G3*'Data Inputs'!D7), 0)","v":0}]
["For Natural Gas-Fired Industrial Boilers >4,100 MMBtu/hour:"]
["TCI = 7,082 x QB x ELEVF x RF",null,null,null,null,null,{"$f":"IF(AND('Data Inputs'!S8=2,'Data Inputs'!P8=3, 'Data Inputs'!P17=4, 'Data Inputs'!C10>4100), (7082*'Data Inputs'!C10*G3*0.8), 0)","v":0},{"$f":"IF(AND('Data Inputs'!S8=3,'Data Inputs'!P8=3, 'Data Inputs'!P17=4, 'Data Inputs'!C10>4100), (7082*'Data Inputs'!C10*G3*'Data Inputs'!D7), 0)","v":0}]
[]
["Total Capital Investment (TCI) =",{"$f":"(G19+H19)*('Data Inputs'!C53/'Data Inputs'!F53)","v":0},null,{"$f":"\"in \"&'Data Inputs'!$C$52 & \" dollars\"","v":"in 2016 dollars"},null,null,{"$f":"SUM(G7:G17)","v":0},{"$f":"SUM(H7:H17)","v":0}]
[]
["TCI for Coal-Fired Boilers"]
["For Coal-Fired Boilers:"]
["TCI = 1.3 x (SCRcost + RPC + APHC + BPC)"]
[]
["Capital costs for the SCR (SCRcost) =",{"$f":"D39","v":7121955.4080239451},null,{"$f":"\"in \"&'Data Inputs'!$C$52 & \" dollars\"","v":"in 2016 dollars"}]
["Reagent Preparation Cost (RPC) =",{"$f":"D47","v":2232373.6209674566},null,{"$f":"\"in \"&'Data Inputs'!$C$52 & \" dollars\"","v":"in 2016 dollars"}]
["Air Pre-Heater Costs (APHC)* = ",{"$f":"D55","v":0},null,{"$f":"\"in \"&'Data Inputs'!$C$52 & \" dollars\"","v":"in 2016 dollars"}]
["Balance of Plant Costs (BPC) =",{"$f":"D64","v":2411594.2829420199},null,{"$f":"\"in \"&'Data Inputs'!$C$52 & \" dollars\"","v":"in 2016 dollars"}]
["Total Capital Investment (TCI) =",{"$f":"1.3*(SUM(B25:B28))","v":15295700.305513447},null,{"$f":"\"in \"&'Data Inputs'!$C$52 & \" dollars\"","v":"in 2016 dollars"}]
[{"$f":"IF(AND('Data Inputs'!P17=2,'Data Inputs'!V11=3),\"* This factor applies because the boiler burns bituminous coal and emits  equal to or greater than 3lb/MMBtu of sulfur dioxide. \", \"* Not applicable - This factor applies only to coal-fired boilers that burn bituminous coal and emits equal to or greater than 3lb/MMBtu of sulfur dioxide.\")","v":"* Not applicable - This factor applies only to coal-fired boilers that burn bituminous coal and emits equal to or greater than 3lb/MMBtu of sulfur dioxide."}]
{"$rows_left_out":75}
{"sheet":"ESRI_MAPINFO_SHEET","index":4,"n_rows":0,"n_cols":0,"rows_kept":0,"cut":false,"hidden":true,"merged":[]}