{"text_format":"1","workbook":"xlsx","n_sheets":5,"sheets":["Read Me","Wet & Dry FGD Data Inputs","WFGD Design Parameters","WFGD Cost Estimate","Appendix"],"not_rendered":{"charts":0,"images":0,"macros":1,"external_links":0,"defined_names":4,"comments":0,"pivot_tables":0},"unopened":[],"bounds":{"document_bytes":16777216,"sheet_cells":100000,"rows_first":2000,"rows_last":500,"rows_between":2000,"halvings":0,"cell_chars":16384,"cell_head_chars":4096},"cells_cut":0,"cells_raw":0,"read":"whole","date_system":"1900"}

{"sheet":"Read Me","index":0,"n_rows":27,"n_cols":3,"rows_kept":27,"cut":false,"hidden":false,"merged":[[20,1,20,13],[21,1,21,13],[25,1,25,13],[26,1,26,13],[0,0,0,14],[1,0,1,14],[8,1,8,13],[10,1,10,13],[24,1,24,13],[2,0,2,14],[3,0,3,14],[4,0,4,14],[5,0,5,14],[6,0,6,14],[23,1,23,13],[18,1,18,13],[12,1,12,13],[14,2,14,12],[15,2,15,12],[16,2,16,12]]}
["Air Pollution Control Cost Estimation Spreadsheet"]
["For Wet and Dry Scrubbers for Acid Gas Control"]
["U.S. Environmental Protection Agency "]
["Air Economics Group"]
["Health and Environmental Impacts Division"]
["Office of Air Quality Planning and Standards"]
["(May 2021)"]
[]
[null,"This spreadsheet allows users to estimate the capital and annualized costs for installing and operating scrubbers for reducing sulfur dioxide and acidic gas emissions from fossil fuel-fired combustion units and other industrial sources of acid gases.  "]
[]
[null,"The calculation methodologies used in this spreadsheet are those presented in the U.S. EPA's Air Pollution Control Cost Manual.  This spreadsheet is intended to be used in combination with the acid gas absorber chapter and cost estimation methodology in the Control Cost Manual. For a detailed description of acid gas absorbers and the cost methodologies, see Section 5, Chapter 1 (Wet and Dry Scrubbers for Acid Gas Control) of the Air Pollution Control Cost Manual (as updated in 2021).  A copy of the Control Cost Manual is available on the U.S. EPA's \"Technology Transfer Network\" website at: https://www.epa.gov/economic-and-cost-analysis-air-pollution-regulations/cost-reports-and-guidance-air-pollution."]
[]
[null,"This spreadsheet can be used to estimate capital and annualized costs for three types of acid gas scrubbers: "]
[]
[null,"(1)   ","Wet flue gas desulfurization (WFGD) systems used to control SO2 emissions from coal-fired utility boilers over 100 MW."]
[null,"(2)   ","Spray dryer absorber (SDA) used to control SO2 emissions from coal-fired utility boilers of equal to or greater than 50 MW."]
[null,"(3)   ","Wet packed-bed scrubbers used to control acid gases from industrial emission sources of any size."]
[]
[null,"WFGD and SDA Control Systems\nThe methodologies for WFGD and SDA systems are based on those from the U.S. EPA Clean Air Markets Division (CAMD)'s Integrated Planning Model (IPM version 6). The size and costs of a WFGD and SDA are based primarily on the size of the combustion unit and the sulfur content of the coal burned. The WFGD methodology include cost algorithms for capital and operating cost for wastewater treatment consisting of chemical pretreatment, low hydraulic residence time biological reduction and ultrafiltration to treat wastewater generated by the WFGD system. The IPM equations estimate the purchased equipment cost and the direct and indirect installation costs based on cost data for multiple lump-sum contracts. Turnkey contracts where the price is fixed at the time the contract is signed and the contractor undertakes responsibility for the completion of the project, are generally 10 to 15% higher than the multiple lump-sum contracts. For additional information regarding the IPM, see the EPA Clean Air Markets webpage at http://www.epa.gov/airmarkets/power-sector-modeling. \n\nUsers should complete the Wet & Dry FGD Data Inputs tab to estimate costs for WFGD and SDA systems. "]
[]
[null,"Packed-Bed Scrubbers\nThe cost methodology for wet packed-bed scrubbers can be used for estimating costs for any size of packed tower absorber used to control flue gas containing any acidic pollutants (e.g., HCl and HF). The capital and operating costs are based on the waste gas composition and properties of the pollutant and sorbent.  The waste gas is assumed to comprise a two-component waste gas mixture (pollutant/air), where the pollutant consists of a single compound present in dilute quantities. The waste gas is assumed to behave as an ideal gas and the solvent is assumed to behave as an ideal solution. Heat effects associated with absorption are considered to be minimal due to the low pollutant concentration. The procedures also assume that, in chemical absorption, the process is not reaction rate limited, i.e., the reaction of the pollutant with the solvent is considered fast compared to the rate of absorption of the pollutant into the solvent. \n\nUsers should complete the PB Scrubber Data Inputs tab to estimate costs for packed-bed scrubbers."]
[null,"The calculations provide study-level estimates (±30%) of capital and annual costs. Default values included in the spreadsheet are taken from the Control Cost Manual and other sources, such as the U.S. Energy Information Administration (EIA), and are included only as an example of how to complete the data inputs sheets. The actual costs may vary from those calculated here due to site-specific conditions. Selection of the most cost-effective control option should be based on a detailed engineering study and cost quotations from control system suppliers. "]
[]
[null,"Instructions "]
[null,"Step 1: Please select the FGD Data Inputs or PB Scrubber Data Inputs tab. Click he Reset Form button at the top of the sheet to reset all parameters to default values. "]
[null,"Step 2: Complete the cells highlighted in yellow. The highlighted cells are pre-populated with example or default values. Users should replace the pre-populated values with current values for each parameter that are specific to the facility. All data entry fields in the PB Scrubber Data Inputs tab should be completed. While most fields in the FGD Data Inputs tab apply to both WFGD and SDA systems, a few data entry fields are specific to the type of control system and may be left blank if the user does not wish to estimate costs for both systems. References documenting the source of each value should be documented in the Data Sources for Default Values Used in Calculations located on the FGD Data Inputs and PB Scrubber Data Inputs tabs."]
[null,"Step 3: Once all of the data fields are complete, select the SDA Design Parameters, WFGD Design Parameters, or PB Scrubber Design Parameters tab (as applicable) to see the calculated design parameters. Select the SDA Cost Estimate, WFGD Cost Estimate, or PB Scrubber Cost Estimate tabs to view the calculated cost data for the installation and operation of the scrubber. "]

{"sheet":"Wet & Dry FGD Data Inputs","index":1,"n_rows":90,"n_cols":19,"rows_kept":90,"cut":false,"hidden":false,"merged":[[43,6,43,7],[71,9,71,13],[73,9,73,13],[78,9,78,13],[78,3,78,8],[76,9,76,13],[74,9,74,13],[75,9,75,13],[71,3,71,8],[72,3,72,8],[76,3,76,8],[70,3,70,8],[74,3,74,8],[73,3,73,8],[75,3,75,8],[70,9,70,13],[57,4,57,6],[43,9,43,10],[38,7,38,8],[0,0,0,14],[2,0,2,14],[6,7,6,8],[17,2,17,7],[11,0,11,1],[11,9,11,14],[14,9,16,12],[14,13,14,14],[6,1,6,4],[66,1,66,7],[14,5,14,6],[19,1,19,4],[18,1,18,9],[39,7,39,8],[30,1,30,3],[32,1,32,3],[20,1,20,4],[26,1,26,2],[21,6,21,7],[31,4,32,6],[84,3,84,8],[84,9,84,13],[81,3,81,8],[81,9,81,13],[72,9,72,13],[77,9,77,13],[77,3,77,8],[79,3,79,8],[79,9,79,13],[80,3,80,8],[80,9,80,13],[89,3,89,8],[89,9,89,13],[88,3,88,8],[88,9,88,13],[85,3,85,8],[85,9,85,13],[86,3,86,8],[86,9,86,13],[87,3,87,8],[87,9,87,13],[82,3,82,8],[82,9,82,13],[83,3,83,8],[83,9,83,13]]}
["Data Inputs for Spray Dryer Absorber and Wet FGD"]
[]
["Enter the following data for your combustion unit:"]
[]
[null,"Is the FGD for a new boiler or retrofit of an existing boiler?"]
[null,null,null,null,null,null,null,null,null,null,null,null,null,null,null,null,null,"Retrofit Box"]
[null,"Please enter a retrofit factor. Enter 1 for projects of average difficulty. Enter values >1 for more difficult retrofits and enter <1 for less difficult retrofits.",null,null,null,null,1,{"$f":"IF(G7>1, \"* NOTE: You must document why a retrofit factor of \"&G7&\" is appropriate for the proposed project.\", \" \")","v":" "},null,null,null,null,null,null,null,null," "]
["Directions: Enter data in highlighted data fields.",null,null,null,null,null,null,null,null,null,null,null,null,null,null,null,null,"New Construction",3]
[null,null,null,null,null,null,null,null,null,null,null,null,null,null,null,null,null,"Retrofit"]
[null,"What is the gross MW rating at full load capacity (A)?",{"$f":"295600*0.8573/8589","v":29.504934218186047},"MW"]
[]
["Provide the following information for the coal burned:",null," "," ",null,null,null,null," "]
[null,"Select type of coal burned:",null,null,null,null,null,null,null,null,null,null,null,null,null,null,null,"Select Coal Type"]
[null,null," "," ",null,null,null,null,null,null,null,null,null,null,null,null,null,"Bituminous",3]
[null,"Enter the sulfur content (%S)",null,"percent by weight","OR"," SO2 Emissions (SO2in)",null,0.2,"lb/MMBtu",{"$f":"IF(AND(C15>0,H15>0),\"*Note: If you enter values for both sulfur content and SO2 emission rate, the SO2 emission rate in lbs/MMBtu will be used to estimate costs.\",\" \")","v":" "},null,null,null,null,null,null,null,"Sub-Bituminous"]
[null,null,{"$f":"IF(OR(C15>0,H15>0),\" \",\"*You must enter a value for either percent sulfur content or SO2 emission rate!\")","v":" "},null,null,null,null,null,null,null,null,null,null,null,null,null,null,"Lignite"]
[null,"Oulet SO2 Emissions (SO2out)",0.01,"lb/MMBtu",null,null,null,null,null,null,null,null,null,null,null,null,null,"Coal blend"]
[null,null," "]
[null,"For units burning coal blends:",null,null,null,null,null,null,null,null,null,null,null,null,null,null,null,"Landfill?",3]
[null,"The table below is pre-populated with default values for HHV and percent sulfur. Please enter the actual values for these parameters in the table below. If the actual value for any parameter is not known, you may use the default values provided.   "]
[null,"Coal Blend Composition Table",null,null,null,null,null,null,null,null,null,null,null,null,null,null,null,"Onsite Landfill"]
[null,null,"Fraction in Coal Blend","Percent Sulfur","HHV (Btu/lb)",null,"Calculated sulfur content of coal blend",null,0,"percent",null,null,null,null,null,null,null,"Offsite Landfill"]
[null,"Bituminous",0,1.84,11841]
[null,"Sub-Bituminous",0,0.41,8826]
[null,"Lignite",0,0.82,6626]
[]
[null,"Please click the calculate button to calculate weighted values based on the data in the table above.  ",null,null,null,null,null,null,null,null,null,null,null,null,null,null,null,2,"Yes"]
[null,null,null,null,null,null,null,null,null,null,null,null,null,null,null,null,null,"Note:  If P25= Yes, then BTF = 0.75 for fluid bed boilers; Else BTF=1","No"]
[]
[null,null,{"$f":"IF(C17>0,\" \",\"*You must enter a value for the outlet SO2 emission rate!\")","v":" "}]
[null," "]
[null,"What is the higher heating value of the fuel (HHV)?",null,"Btu/lb",{"$f":"IF(H15>0,\"*Note: You do not need to enter a value for the HHV since you entered SO2 emissions in lb/MMBtu above\",\" \")","v":"*Note: You do not need to enter a value for the HHV since you entered SO2 emissions in lb/MMBtu above"}]
[null,{"$f":"IF(C32=M23,\"*HHV is the weighted average value calculated using the values entered in the coal blend composition table.\",(IF(OR(C32=C77,C32=1033,C32=11814,C32=6534,C32=8730,C32=141468),\"*HHV value of \"&C32&\" \"&D32&\" is a default value. See below for data source. Enter actual HHV for fuel burned, if known. \",\" \")))","v":"*HHV is the weighted average value calculated using the values entered in the coal blend composition table."}]
[null,"What is the estimated actual annual MWh output?",{"$f":"C10*C44","v":258463.22375130976},"MWh"]
[]
[null,"Waste from a WFDG system disposed in an onsite or offsite landfill?"]
[]
[null,"Gross heat input rate (GHR)",{"$f":"295.6/C10","v":10.018663245071739},"MMBtu/MWh"]
[null,null," "]
[null,null," "]
{"$rows_left_out":51}
{"sheet":"WFGD Design Parameters","index":2,"n_rows":44,"n_cols":12,"rows_kept":44,"cut":false,"hidden":false,"merged":[[19,0,19,3],[24,3,25,3],[26,3,27,3],[0,0,0,7],[2,0,2,7],[14,4,14,7],[15,4,15,7],[16,4,17,7]]}
["Wet FGD Design Parameters"]
[]
["The following design parameters for the wet FGD system were calculated based on the values entered on the FGD Data Inputs tab. These values were used to prepare the costs shown on the Wet FGD Cost Estimate tab."]
[]
["Parameter","Equation","Calculated Value","Units"]
["Maximum Annual Heat Input Rate (QB) = ","A x GHR = ",{"$f":"'Wet & Dry FGD Data Inputs'!C10*'Wet & Dry FGD Data Inputs'!C38","v":295.60000000000002},"MMBtu/hour"]
["Maximum Annual MWh Output  (BMW) =","A x 8760 = ",{"$f":"'Wet & Dry FGD Data Inputs'!C10*8760","v":258463.22375130976},"MWh"]
["Estimated Actual Annual MWh Output (Boutput) =","Value entered by user",{"$f":"'Wet & Dry FGD Data Inputs'!C34","v":258463.22375130976},"MWh"]
["Heat Rate Factor (HRF) =","Gross Plant Heat Rate/10 =",{"$f":"'Wet & Dry FGD Data Inputs'!C38/10","v":1.0018663245071739}]
["Total System Capacity Factor (CFtotal) =","(Boutput/Bmw)*(tABS/tplant) =",{"$f":"(C8/C7)*('Wet & Dry FGD Data Inputs'!C44/'Wet & Dry FGD Data Inputs'!C45)","v":1},"fraction"]
["Total effective operating time for the scrubber (top) =","CFtotal x 8760 =",{"$f":"C10*8760","v":8760},"hours"]
["SO2 Removal Efficiency (EF) =","(SO2in - SO2out)/SO2in =",{"$f":"((C16-'Wet & Dry FGD Data Inputs'!C17)/C16)*100","v":95},"percent"]
["SO2 removed per hour =","SO2in x EF x QB  =",{"$f":"(C12/100)*C16*'WFGD Design Parameters'!C6","v":56.164000000000001},"lb/hour"]
["Total SO2 removed per year =","(SO2in x EF x QB x top)/2000 =",{"$f":"C13*C11/2000","v":245.99832000000001},"tons/year"]
["Coal Factor (CoalF) =","1 for bituminous; 1.05 for sub-bituminous; 1.07 for lignite (weighted average is used for coal blends)",{"$f":"IF('Wet & Dry FGD Data Inputs'!S14=1,\" \",(IF('Wet & Dry FGD Data Inputs'!S14=2,1,(IF('Wet & Dry FGD Data Inputs'!S14=3,1.05,(IF('Wet & Dry FGD Data Inputs'!S14=4,1.07,L15)))))))","v":1.05},null,null,null,null,null,null,null,null,{"$f":"((1*'Wet & Dry FGD Data Inputs'!C23)+(1.05*'Wet & Dry FGD Data Inputs'!C24)+(1.07*'Wet & Dry FGD Data Inputs'!C25))/SUM('Wet & Dry FGD Data Inputs'!C23:C25)","v":{"$error":"#DIV/0!"}}]
["Inlet SO2 Emissions (SO2in) =",{"$f":"IF('Wet & Dry FGD Data Inputs'!H15>0,\"Value entered by user\",\"(Percent Sulfur/100) x (64/32) x 1,000,000)/Heat Input (Btu/Hour) =\")","v":"Value entered by user"},{"$f":"IF(OR('Wet & Dry FGD Data Inputs'!H15=\" \",'Wet & Dry FGD Data Inputs'!H15=0),(('Wet & Dry FGD Data Inputs'!C15/100)*(64/32)*1000000)/'Wet & Dry FGD Data Inputs'!C32,'Wet & Dry FGD Data Inputs'!H15)","v":0.2},"lb/MMBtu"]
["Elevation Factor (ELEVF)  = ","14.7 psia/P =",{"$f":"IF('Wet & Dry FGD Data Inputs'!I44<500, \" \", (14.7/C18))","v":" "},null,{"$f":"IF('Wet & Dry FGD Data Inputs'!I44<500, \"Not applicable; elevation factor does not apply to plants located at elevations below 500 feet.\", \" \")","v":"Not applicable; elevation factor does not apply to plants located at elevations below 500 feet."}]
[{"$f":"IF('Wet & Dry FGD Data Inputs'!I44=0,\"Atmospheric pressure at sea level (P) =\",\"Atmospheric pressure at \"&'Wet & Dry FGD Data Inputs'!I44&\" feet above sea level (P) =\")","v":"Atmospheric pressure at 446 feet above sea level (P) ="},"2116 x [(59-(0.00356xh)+459.7)/518.6]5.256 x (1/144)* =",{"$f":"(2116)*(((59-(0.00356*'Wet & Dry FGD Data Inputs'!I44)+459.7)/518.6)^5.256)*(1/144)","v":14.474223928639134},"psia"]
["Retrofit Factor (RF) =",{"$f":"IF('Wet & Dry FGD Data Inputs'!S8=2,\"New Construction\",(IF('Wet & Dry FGD Data Inputs'!S8=3,\"Retrofit to existing boiler\",\" \")))","v":"Retrofit to existing boiler"},{"$f":"IF('Wet & Dry FGD Data Inputs'!S8=2,0.77,(IF('Wet & Dry FGD Data Inputs'!S8=3,'Wet & Dry FGD Data Inputs'!G7,\" \")))","v":1}]
["* Equation is from the National Aeronautics and Space Administration (NASA), Earth Atmosphere Model. Available at https://spaceflightsystems.grc.nasa.gov/education/rocket/atmos.html. "]
[]
["Capital Recovery Factor:"]
[]
["Parameter","Equation","Calculated Value"]
["Capital Recovery Factor (CRF) = ","i (1+ i)n/(1+ i)n - 1 =",{"$f":"ROUND((('Wet & Dry FGD Data Inputs'!C58/100)*((1+'Wet & Dry FGD Data Inputs'!C58/100)^'Wet & Dry FGD Data Inputs'!C51))/(((1+'Wet & Dry FGD Data Inputs'!C58/100)^'Wet & Dry FGD Data Inputs'!C51)-1),4)","v":8.4699999999999998E-2},"Wet FGD System"]
[null,"Where n = Equipment Life and i= Interest Rate"]
[null,null,{"$f":"ROUND((('Wet & Dry FGD Data Inputs'!C58/100)*((1+'Wet & Dry FGD Data Inputs'!C58/100)^'Wet & Dry FGD Data Inputs'!C52))/(((1+'Wet & Dry FGD Data Inputs'!C58/100)^'Wet & Dry FGD Data Inputs'!C52)-1),4)","v":0.21299999999999999},"Mercury Monitor for Wastewater Treatment System"]
[]
[]
["Parameter","Equation","Calculated Value","Units"]
["Electricity Usage:"]
["Electricity Consumption (P) = ","0.0112e0.155xS x CoalF x HRF x A x 1,000 =",{"$f":"0.0112*EXP(0.155*C16)*'WFGD Design Parameters'!C15*'WFGD Design Parameters'!C9*'Wet & Dry FGD Data Inputs'!C10*1000","v":358.57076717985484},"kW"]
[]
["Water Usage:"]
["Water consumption (qwater) =                                                                          ","[(1.674 x S + 74.68) x A x CoalF x HRF]/1,000",{"$f":"(((1.674*C16)+74.68)*'Wet & Dry FGD Data Inputs'!C10*'WFGD Design Parameters'!C15*'WFGD Design Parameters'!C9)/1000","v":2.3283093624000002},"kgallons/hour"]
[]
["Limestone Usage:"]
["Limestone consumption rate (QLimestone) =","[17.52 x A x S x HRF]/2,000] x (EF/0.98) =",{"$f":"((17.52*'Wet & Dry FGD Data Inputs'!C10*C16*'WFGD Design Parameters'!C9)/2000)*('WFGD Design Parameters'!C12/98)","v":5.0203738775510209E-2},"tons/hour"]
[]
["Waste Generation:"]
{"$rows_left_out":5}
{"sheet":"WFGD Cost Estimate","index":3,"n_rows":85,"n_cols":7,"rows_kept":85,"cut":false,"hidden":false,"merged":[[9,2,9,3],[0,0,0,3],[2,0,2,3],[4,0,4,3],[5,0,5,3],[7,0,7,3],[21,2,21,3],[10,2,10,3],[12,2,12,3],[14,2,14,3],[17,0,17,3],[19,0,19,3],[20,0,20,3],[40,0,40,3],[24,0,24,3],[25,0,25,3],[26,0,26,3],[28,2,28,3],[29,0,29,2],[38,0,38,3],[39,0,39,3],[54,0,54,3],[56,2,56,3],[57,2,57,3],[45,0,45,3],[46,0,46,3],[47,0,47,3],[48,0,48,3],[50,2,50,3],[81,0,81,3],[82,2,82,3],[36,0,36,2],[31,0,31,3],[32,0,32,3],[33,0,33,3],[35,2,35,3],[44,0,44,3],[58,2,58,3],[60,0,60,3],[61,0,61,3],[72,0,72,3],[73,0,73,3],[79,0,79,3],[42,2,42,3],[53,0,53,3]]}
["Wet FGD Cost Estimate"]
[]
["Total Capital Investment (TCI)"]
[]
[]
["TCI = 1.3 x (ABScost + RPEcost + WHECost + BOPcost) + WWTCost"]
[]
[]
[]
["Capital costs for the absorber (ABScost) =",{"$f":"B22","v":8478739.3775125388}]
["Reagent Preparation Equipment Costs (RPEcost) = ",{"$f":"B29","v":1839171.777046551}]
["Waste Handling Equipment (WHECost) =",{"$f":"B36","v":758320.42887695774}]
["Balance of Plant Costs (BOPcost) =",{"$f":"B43","v":16102837.151848454}]
["Wastewater Treatment Facility Costs (WWTcost) =",{"$f":"B51","v":13565812.254422294}]
["Total Capital Investment (TCI) =",{"$f":"1.3*(SUM(B10:B14))","v":52968345.286618829},{"$f":"\"in \"&'Wet & Dry FGD Data Inputs'!$C$56&\" dollars\"&(IF('Wet & Dry FGD Data Inputs'!S19=2,\" with disposal at onsite landfill\",IF('Wet & Dry FGD Data Inputs'!S19=3,\" with disposal at offsite landfill\",\" \")))","v":"in 2022 dollars with disposal at offsite landfill"}]
[]
[null,null,null,null,null,"RF",{"$f":"IF('Wet & Dry FGD Data Inputs'!S8=3,'Wet & Dry FGD Data Inputs'!G7,(IF('Wet & Dry FGD Data Inputs'!S8=2,0.77,0)))","v":1}]
["Wet FGD Capital Costs (ABScost)",null,null,null,null,"ELEVF",{"$f":"IF('Wet & Dry FGD Data Inputs'!I44<500, 1,#REF!)","v":1}]
[null,null,null,null,null,"CEPCI",{"$f":"'Wet & Dry FGD Data Inputs'!C57/'Wet & Dry FGD Data Inputs'!F57","v":1.3069964925235369}]
["ABScost = 584,000 x (A)0.716 x (CoalF x HRF)0.6  x (S/2)0.02 x ELEVF x RF"]
[]
["Wet FGD Capital Costs (ABScost) = ",{"$f":"584000*('Wet & Dry FGD Data Inputs'!C10^0.716)*(('WFGD Design Parameters'!C15*'WFGD Design Parameters'!C9)^0.6)*(('WFGD Design Parameters'!C16/2)^0.02)*G18*G17*G19","v":8478739.3775125388},{"$f":"\"in \"&'Wet & Dry FGD Data Inputs'!$C$56 & \" dollars\"","v":"in 2022 dollars"}]
[]
[]
["Reagent Preparation Costs (RPEcost)"]
[]
[" RPEcost = 202,000 x A0.716 x (S x HRF)0.3 x RF"]
[]
["Reagent Preparation (RPEcost) = ",{"$f":"202000*('Wet & Dry FGD Data Inputs'!C10^0.716)*(('WFGD Design Parameters'!C16*'WFGD Design Parameters'!C9)^0.3)*G17*G19","v":1839171.777046551},{"$f":"\"in \"&'Wet & Dry FGD Data Inputs'!$C$56 & \" dollars\"","v":"in 2022 dollars"}]
[]
[]
["Waste Handling Equipment (WHECost)"]
[]
[" WHEcost = 106,000 x A0.716 x (S x HRF)0.45 x RF"]
[]
["Waste Recycling/Handling (WHEcost) = ",{"$f":"106000*('Wet & Dry FGD Data Inputs'!C10^0.716)*(('WFGD Design Parameters'!C16*'WFGD Design Parameters'!C9)^0.45)*G17*G19","v":758320.42887695774},{"$f":"\"in \"&'Wet & Dry FGD Data Inputs'!$C$56 & \" dollars\"","v":"in 2022 dollars"}]
[]
[]
["Balance of Plant Costs (BOPcost)"]
[]
{"$rows_left_out":46}
{"sheet":"Appendix","index":4,"n_rows":113,"n_cols":11,"rows_kept":113,"cut":false,"hidden":false,"merged":[[51,5,51,6],[70,0,71,0],[70,1,71,1],[70,2,70,3],[1,7,2,7],[51,0,52,0],[51,1,52,1],[51,2,51,4],[1,8,2,8],[1,9,2,9],[1,10,2,10],[1,0,2,0],[1,1,2,1],[1,2,2,2],[1,3,1,4]]}
["Typical Costs for Random Packing Materials (1991$)",null,null,null,null,null,null,"Physical Properties of Common Pollutants"]
["Nominal Diameter (inches)","Construction Material","Packing Type","Packing cost ($/ft3)",null,null,null,"Pollutant","Molecular Weight","Diffusivity in Air at 25°C (cm2/sec)","Diffusivity in Water at 20°C (cm2/sec x 105)"]
[null,null,null,"<100 ft3",">100 ft3"]
[1,"304 stainless steel","Pall rings, Raschig rings, Ballast rings","70-109","65-99",null,null,"Ammonia",17,0.23599999999999999,1.76]
[1,"Ceramic","Raschig rings, Berl saddles","33-44","26-36",null,null,"Methanol",32,0.159,1.28]
[1,"Polypropylene","Tri-PakÒ, Pall rings, Ballast rings, Flexisaddles ","14-37","1934-12-01",null,null,"Ethyl Alcohol",46,0.11899999999999999,1]
[2,"Ceramic","Berl saddles, Raschig rings","13-32","2021-10-30",null,null,"Propyl Alcohol",60,0.1,0.87]
[2,"Polypropylene","Tri-PacÒ, LanpacÒ, Flexiring, Flexisaddle TelleretteÒ ","2021-03-20","2021-05-19",null,null,"Butyl Alcohol",74,0.09,0.77]
[3.5,"304 stainless steel","Ballast rings",30,27,null,null,"Acetic Acid",60,0.13300000000000001,0.88]
[3.5,"Polypropylene","Tri-packÒ, LanpacÒ, Ballast rings","2021-06-14","2021-06-12",null,null,"Hydrogen Chloride",36,0.187,2.64]
[null,null,null,null,null,null,null,"Hydrogen Bromide",36,0.129,1.93]
["Typical Packing Factors for Various Packing Materials for Wet Packed Tower Absorbers",null,null,null,null,null,null,"Hydrogen Fluoride",20,0.753,3.33]
["Packing Type","Construction Level","Nominal Diameter (inches)","Fp","a"]
["Raschig rings","Ceramic",0.5,640,111]
[null,null,0.625,380,100]
[null,null,0.75,255,80]
[null,null,1,160,58]
[null,null,1.5,95,38]
[null,null,2,65,28]
[null,null,3,37]
["Raschig rings","Metal",0.5,410,118]
[null,null,0.625,290]
[null,null,0.75,230,72]
[null,null,1,137,57]
[null,null,1.5,83,41]
[null,null,2,57,31]
[null,null,3,32,21]
["Pall rings","Metal",0.625,70,131]
[null,null,1,48,66]
[null,null,1.5,28,48]
[null,null,2,20,36]
[null,null,3.5,16]
["Pall rings","Polypropylene",0.625,97,110]
[null,null,1,52,63]
[null,null,1.5,32,39]
[null,null,2,25,31]
["Berl saddles","Ceramic",0.5,240,142]
[null,null,0.75,170,82]
[null,null,1,110,76]
[null,null,1.5,65,44]
{"$rows_left_out":73}